{"text_format":"1","workbook":"xlsx","n_sheets":13,"sheets":["Intent","Instructions","OF Readiness Scoring Summary","Action Plan","Addtl Gaps","OFRA (Tour Checklist)","Leadership","Plan the Order","Acquire the Material","Make the Order","Terminology","MCT","History of Changes"],"not_rendered":{"charts":1,"images":3,"macros":1,"external_links":0,"defined_names":17,"comments":1,"pivot_tables":0},"unopened":[],"bounds":{"document_bytes":16777216,"sheet_cells":100000,"rows_first":2000,"rows_last":500,"rows_between":2000,"halvings":0,"cell_chars":16384,"cell_head_chars":4096},"cells_cut":0,"cells_raw":0,"read":"whole","date_system":"1900"}

{"sheet":"Intent","index":0,"n_rows":12,"n_cols":1,"rows_kept":12,"cut":false,"hidden":true,"merged":[[7,0,7,2],[3,0,3,2],[8,0,8,2],[11,0,11,2],[9,0,9,2],[4,0,4,2],[10,0,10,2],[0,0,0,2],[1,0,1,2],[2,0,2,2],[5,0,5,2],[6,0,6,2]]}
["OF Risk Assessment - Intent"]
["This is a high-level assessment intended to assess supplier order fulfillment (Delivery) readiness, identify risks, and drive improvements."]
["This assessment is performed at the supplier and takes approximately 1.5 days to complete."]
["Click here to review EXPECTATIONS OF SUPPLIER"]
["Click here to review ASSESSOR INSTRUCTIONS"]
["John Deere targets a minimum score of 3 for each question to limit order fulfillment risk in the supply chain. Questions scored below a 3 are considered to be gaps-to-the-assessment. As part of the supplier selection process, each gap will require an Action Plan and must be reviewed with John Deere Supply Management professionals."]
{"$rows_left_out":7}
{"sheet":"Instructions","index":1,"n_rows":70,"n_cols":6,"rows_kept":70,"cut":false,"hidden":true,"merged":[[0,0,0,3],[2,1,2,3],[3,1,3,3],[4,1,4,2],[30,1,30,3],[9,1,9,3],[17,1,17,3],[18,1,18,3],[22,1,22,3],[23,1,23,3],[24,1,24,3],[21,1,21,3],[25,1,25,3],[26,1,26,3],[1,0,1,3],[28,1,28,3],[7,0,7,1],[69,1,69,3],[51,1,52,1],[51,2,52,2],[51,3,52,3],[59,1,59,4],[51,4,52,4],[60,1,61,1],[60,2,61,2],[60,3,61,3],[60,4,61,4],[68,1,68,2],[50,1,50,4],[31,1,31,3],[5,0,5,1],[48,1,48,2],[47,1,47,2],[46,1,46,2],[45,1,45,2],[16,0,16,1],[15,0,15,1],[14,0,14,1],[12,0,12,1],[6,0,6,1],[20,0,20,3],[13,0,13,1],[29,1,29,3],[34,1,34,3],[27,1,27,3],[8,0,8,1]]}
["Order Fulfillment Risk Assessment"]
["EXPECTATIONS OF SUPPLIER"]
["o","Watch the 4 min. OFRA introduction video (no login required)"]
["o","Notify lead assessor of any specific requirements of entry to facility such as personal protective equipment, confidentiality agreements, multiple manufacturing locations, etc."]
["o","Prepare for assessment"]
["o",null,"Assign an owner for each section"]
{"$rows_left_out":65}
{"sheet":"OF Readiness Scoring Summary","index":2,"n_rows":32,"n_cols":9,"rows_kept":32,"cut":false,"hidden":false,"merged":[[31,4,31,7],[32,4,32,7],[25,6,25,7],[25,4,25,5],[30,6,30,7],[26,4,26,5],[27,4,27,5],[28,4,28,5],[29,4,29,5],[27,6,27,7],[28,6,28,7],[29,6,29,7],[30,4,30,5],[26,6,26,7],[22,2,22,7],[17,1,17,7],[20,1,20,7],[24,2,24,3],[16,1,16,7],[19,1,19,7],[18,0,18,7],[24,4,24,5],[24,6,24,7],[3,2,3,3],[3,4,3,7],[4,2,4,3],[4,4,4,7],[5,2,5,3],[5,4,5,7],[0,2,0,4],[0,5,0,7],[1,2,1,3],[1,4,1,7],[2,2,2,3],[2,4,2,7],[6,2,6,3],[6,4,6,7],[7,4,7,7],[7,2,7,3],[8,4,8,7],[10,2,10,3],[10,4,10,7],[11,2,11,3],[11,4,11,7],[9,4,9,7],[12,4,12,7],[13,2,13,3],[13,4,13,7],[15,0,15,7],[14,0,14,7]]}
["SUPPLIER NAME: ",null,"ASSESSMENT DATE: "]
[]
["Supplier #: ",null,"Audit #:"]
[null,null,"Other Supplier Participants: "]
["Address:"]
[]
{"$rows_left_out":27}
{"sheet":"Action Plan","index":3,"n_rows":23,"n_cols":8,"rows_kept":23,"cut":false,"hidden":false,"merged":[[4,0,5,7],[20,0,21,7],[22,5,22,7],[23,5,23,7],[24,5,24,7],[26,5,26,7],[6,0,6,4],[6,5,6,7],[22,2,22,4],[23,2,23,4],[24,2,24,4],[25,2,25,4],[26,2,26,4],[25,5,25,7],[31,2,31,4],[30,5,30,7],[31,5,31,7],[32,2,32,4],[33,2,33,4],[32,5,32,7],[33,5,33,7],[30,2,30,4],[27,2,27,4],[27,5,27,7],[28,2,28,4],[29,2,29,4],[28,5,28,7],[29,5,29,7],[1,2,1,3],[2,2,2,3],[0,5,0,7],[1,5,1,7],[2,5,2,7]]}
["Supplier Name: ",null,null,{"$f":"IF(NOT(ISBLANK('OF Readiness Scoring Summary'!B1)),'OF Readiness Scoring Summary'!B1,\"\")","v":""},"Assessment Date:",{"$f":"IF(NOT(ISBLANK('OF Readiness Scoring Summary'!F1)),'OF Readiness Scoring Summary'!F1,\"\")","v":""}]
[null,"Supplier Location: ",null,null,"Updated Date: "]
[null,"Supplier Number: ",{"$f":"IF(NOT(ISBLANK('OF Readiness Scoring Summary'!B3)),'OF Readiness Scoring Summary'!B3,\"\")","v":""},null,"Lead Assessor: ",{"$f":"IF(NOT(ISBLANK('OF Readiness Scoring Summary'!E7)),'OF Readiness Scoring Summary'!E7,\"\")","v":""}]
[]
["GAPS TO THE ASSESSMENT\nSupplier scored less than a 3 for each question below and should provide corrective action to close the gap.\n NCCA(s) or factory equivalent to be created for scores of 0 or 1."]
[]
{"$rows_left_out":18}
{"sheet":"Addtl Gaps","index":4,"n_rows":4,"n_cols":8,"rows_kept":4,"cut":false,"hidden":false,"merged":[[2,0,2,4],[2,5,2,7],[0,0,1,7]]}
["GAPS TO THE ASSESSMENT\nSupplier scored less than a 3 for each question below and should provide corrective action to close the gap.\n NCCA(s) or factory equivalent to be created for scores of 0 or 1."]
[]
["John Deere Assessor",null,null,null,null,"Supplier Completes"]
["Category","Question\nNumber","Score","Gap Description","NCCA\n#","Action Plan","Owner","Target\nDate"]

{"sheet":"OFRA (Tour Checklist)","index":5,"n_rows":41,"n_cols":3,"rows_kept":41,"cut":false,"hidden":false,"merged":[]}
["Lane","New OFRA tour checklist","Notes"]
["Leadership"]
[1.2," Metrics shared with employees, updated at least monthly"]
[]
[1.5,"If applicable, evidence of capture of CI ideas from operators."]
[1.6,"Training matrix, logs or HR records"]
{"$rows_left_out":36}
{"sheet":"Leadership","index":6,"n_rows":17,"n_cols":12,"rows_kept":17,"cut":false,"hidden":false,"merged":[[0,11,1,11],[2,4,3,4],[2,5,2,7],[2,11,3,11],[2,0,3,0],[2,1,3,1],[2,2,3,2],[2,3,3,3],[2,10,3,10],[1,3,1,10],[1,0,1,2]]}
["Order Fulfillment (OF) Risk Assessment",null,null,null,null,null,null,null,null,null,null,"Supplier \"Leadership\" Lane Owner:\n Name: \n Email:\n Phone:"]
["Leadership",null,null,"This section includes all activities that the supplier performs from a strategic position to ensure continuity of supply and continual improvement."]
["#","Question Content","Interview Questions\nSupplier to demonstrate compliance through examples","Score \n(0-5)        0=low","Assessment Comments - Required:  Describe in detail what the supplier used to support their answer","Scoring Criteria",null,null,"Maximum Points","Achieved Points","Required Verification","Example Supporting Evidence\n(see Intent tab for clarification)"]
[null,null,null,null,null,1,3,5,{"$f":"SUM(I5,I12,I15)","v":100},{"$f":"SUM(J5,J12,J15)","v":0}]
["Business Management",null,null,{"$f":"J5/I5","v":0},null,null,null,null,{"$f":"SUM(I6:I11)","v":70},{"$f":"SUM(J6:J11)","v":0}]
["1.0","Business Growth","How is your business strategy supporting organization /company vision or growth?",null,null,"● Limited explanation of business strategy","\n● Supplier has documented business strategy \n\n● Supplier has documented internal business reviews, such as a SWOT analysis\n\n● Supplier can verbally explain competitiveness within their industry and plans to maintain\n\n● Supplier can demonstrate understanding of broader industry trends (investing in new tech, to set apart) \n","● All of a \"3\"\n\n● Supplier has documented short-term and long-term year business strategy to maintain competitiveness within their industry\n\n● Supplier internal business reviews, (such as a SWOT analysis) including industry analysis (capital, labor/pay, reverse engineering, methods/tech)\n\n● Supplier has documented knowledge of marketplace competitiveness and/or benchmarking activities",{"$f":"IF($D6=\"N/A\",0,10)","v":10},{"$f":"IF(D6=\"N/A\", 0,   IF(D6=3,   3.25*I6/5,            D6*I6/5))","v":0},"Documentation","Strategic business plan\nShort-term business strategy is 1-3 year\nLong-termbusiness strategy is 3-10 year\nCapital investment plan\nIndustrial Competitive Analysis\nSWOT analysis\nProjected Demand Forecast"]
{"$rows_left_out":12}
{"sheet":"Plan the Order","index":7,"n_rows":12,"n_cols":12,"rows_kept":12,"cut":false,"hidden":false,"merged":[[2,4,3,4],[2,5,2,7],[0,0,0,10],[2,10,3,10],[2,11,3,11],[1,3,1,10],[1,0,1,2],[0,11,1,11],[2,0,3,0],[2,1,3,1],[2,2,3,2],[2,3,3,3]]}
["Order Fulfillment (OF) Risk Assessment",null,null,null,null,null,null,null,null,null,null,"Supplier \"Plan the Order\" Lane Owner:\n Name: \n Email:\n Phone:"]
["Plan the Order",null,null,"This section pertains to ensuring the supplier has a system in place to receive Deere forecast and firm order requirements and to transfer them to their in house production planning system."]
["#","Question Content","Interview Questions\nSupplier to demonstrate compliance through examples","Score \n(0-5)        0=low","Assessment Comments - Required:  Describe in detail what the supplier used to support their answer","Scoring Criteria",null,null,"Maximum Points","Achieved Points","Required Verification","Example Supporting Evidence\n(see Intent tab for clarification)"]
[null,null,null,null,null,1,3,5,{"$f":"SUM(I5)","v":75},{"$f":"SUM(J5)","v":0}]
["Order Planning",null,null,{"$f":"+J5/I5","v":0},null,null,null,null,{"$f":"SUM(I6:I12)","v":75},{"$f":"SUM(J6:J12)","v":0}]
["2.0","Order Receipt","How do you receive and transfer orders into MRP from your customers? ",null,null,"● Extensive manual processes  to receive and input customer orders","\n● Receipt of orders is not automatically integrated with the in-house MRP or ERP system, but WEB-EDI capable\n\n● Several effective manual interactions are used to input customer orders\n\n● System is updated at least weekly \n","\n● All of a \"3\"\n\n● EDI capable\n\n● Customer requirements are automatically integrated into MRP or ERP system \n\n● System is updated daily\n",{"$f":"IF($D6=\"N/A\",0,10)","v":10},{"$f":"IF(D6=\"N/A\", 0,   IF(D6=3,   3.25*I6/5,            D6*I6/5))","v":0},"Documenation","Process Map\nWork instructions\nDocumented process\nDemonstration of order entry process"]
{"$rows_left_out":7}
{"sheet":"Acquire the Material","index":8,"n_rows":16,"n_cols":12,"rows_kept":16,"cut":false,"hidden":false,"merged":[[2,4,3,4],[2,5,2,7],[0,0,0,10],[2,10,3,10],[2,11,3,11],[0,11,1,11],[1,0,1,2],[1,3,1,10],[2,0,3,0],[2,1,3,1],[2,2,3,2],[2,3,3,3]]}
["Order Fulfillment (OF) Risk Assessment",null,null,null,null,null,null,null,null,null,null,"Supplier \"Acquire the Material\" Lane Owner:\n Name: \n Email:\n Phone:"]
["Acquire the Material",null,null,"This section pertains to ensuring that the supplier has a replenishment system in place with its supply base to ensure that raw material and purchased components are available when needed."]
["#","Question Content","Interview Questions\nSupplier to demonstrate compliance through examples","Score \n(0-5)        0=low","Assessment Comments - Required:  Describe in detail what the supplier used to support their answer","Scoring Criteria",null,null,"Maximum Points","Achieved Points","Required Verification","Example Supporting Evidence\n(see Intent tab for clarification)"]
[null,null,null,null,null,1,3,5,{"$f":"SUM(I5,I11)","v":105},{"$f":"SUM(J5,J11)","v":0}]
["Invnentory Management",null,null,{"$f":"+J5/I5","v":0},null,null,null,null,{"$f":"SUM(I6:I10)","v":60},{"$f":"SUM(J6:J10)","v":0}]
["3.0","Inventory Management","How do you track the accuracy of your inventory system (Raw material / wip / finished goods)?",null,null,"● Annual inventory count is done but data not utilized for improvement","\n● Supplier has a mature process in place to measure inventory accuracy , monthly\n\n● Total inventory accuracy is at least 85% and can be verified\n\n● Verbal/informal process to analyze discrepancies/gaps to the analysis to avoid reoccurency\n\n● Historical trend data provided (minimum 6 months)\nImprovement plan in place when goals are not met\n","\n● All of a \"3\"\n\n● Total inventory accuracy is 95% or greater and can be verified\n\n● Supplier performs cycle counts and/or regular inventory count at least weekly for a random selection of parts\n\n● Documented process to analyze discrepancies/gaps to the analysis to avoid reoccurency\n",{"$f":"IF($D6=\"N/A\",0,15)","v":15},{"$f":"IF(D6=\"N/A\", 0,   IF(D6=3,   3.25*I6/5,            D6*I6/5))","v":0},"Documenation","Historical inventory accuracy data\nInventory accuracy KPI\nExample inventory accuracy improvements\nInventory management process documents\nCycle counts process"]
{"$rows_left_out":11}
{"sheet":"Make the Order","index":9,"n_rows":18,"n_cols":12,"rows_kept":18,"cut":false,"hidden":false,"merged":[[2,4,3,4],[2,5,2,7],[0,0,0,10],[2,10,3,10],[2,11,3,11],[0,11,1,11],[1,0,1,2],[1,3,1,10],[2,0,3,0],[2,1,3,1],[2,2,3,2],[2,3,3,3]]}
["Order Fulfillment (OF) Risk Assessment",null,null,null,null,null,null,null,null,null,null,"Supplier \"Make the Order\" Lane Owner:\n Name: \n Email:\n Phone:"]
["Make the Order",null,null,"This section includes all activities that the supplier performs once the supplier authorizes production and concludes with the completed order staged for pickup."]
["#","Question Content","Interview Questions\nSupplier to demonstrate compliance through examples","Score \n(0-5)        0=low","Assessment Comments - Required:  Describe in detail what the supplier used to support their answer","Scoring Criteria",null,null,"Maximum Points","Achieved Points","Required Verification","Example Supporting Evidence\n(see Intent tab for clarification)"]
[null,null,null,null,null,1,3,5,{"$f":"SUM(I5,I15)","v":150},{"$f":"SUM(J5,J15)","v":0}]
["Capacity Management",null,null,{"$f":"+J5/I5","v":0},null,null,null,null,{"$f":"SUM(I6:I14)","v":120},{"$f":"SUM(J6:J14)","v":0}]
["4.0","Capacity Management","How do you quantify your capacity? ",null,null,"● Verbal explanation of capacity plan\n\n● Capacity calculation only done for a few processes","\n● Capacity is quantified for all processes, parts or part families \n\n● Capacity is calculated in appropriate units (e.g., tons/shift, pieces/day, hours/month, etc.)\n\n● Documented capacity calculations including both machine (tooling) and manpower\n\n● Calculations are using a manual process\n","● All of a \"3\"\n\n● Capacity calculations are automated using system data\n\n● Documented process to monitor/review internal capacity and action plan in place if needed ",{"$f":"IF($D6=\"N/A\",0,20)","v":20},{"$f":"IF(D6=\"N/A\", 0,   IF(D6=3,   3.25*I6/5,            D6*I6/5))","v":0},"Documentation","Capacity analysis\nUtilization rate analysis\nThroughput analysis\nCapacity metrics\nTakt time documentation"]
{"$rows_left_out":13}
{"sheet":"Terminology","index":10,"n_rows":42,"n_cols":2,"rows_kept":42,"cut":false,"hidden":false,"merged":[]}
["Terminology","Definition"]
["5-S System ","Program focuses on having visual order, organization, cleanliness and standardization. The results you can expect from a Five S program are: improved profitability, efficiency, service and safety."]
["AIAG (The Automotive Industry Action Group) ","A non-profit group to improve the quality of automotive and industrial manufacturers. Website: AIAG.ORG"]
["APQP (Advanced Quality Product Planning)","A program management process to ensure proper development and timing actives for new programs."]
["ASN (Advanced Shipping Notice)","The ASN is issued to the customer prior to product shipment.  It can be used to list the contents of a shipment of goods as well as additional information relating to the shipment, such as order information, product description, physical characteristics, type of packaging, marking, carrier information, and configuration of goods within the transportation equipment."]
["Batch Size","The number of parts produced before changing to the next part number.  Also know as lot size."]
{"$rows_left_out":37}
{"sheet":"MCT","index":11,"n_rows":8,"n_cols":2,"rows_kept":8,"cut":false,"hidden":true,"merged":[[1,3,1,4],[2,3,2,4]]}
["Terminology","Definition"]
["MCTTotal","MCTTotal is a measure of order fulfillment lean-ness and is used to drive reduction in system wide waste.  MCTTotal is composed of all components of MCT, including:  MCTRaw (Procurement and Inventory), MCTOperations (Planning and Manufacturing), MCTLogistics, and MCTContingency"]
["MCTResponse","MCTResponse is a measure of order fulfillment responsiveness and used to define how long it takes for a supplier to react to previously unplanned orders.  MCTResponse is composed of the MCTRaw (Procurement), MCTOperations (Planning),  MCTOperations (Manufacturing), and MCTLogistics components of MCT.  Also remember for the MCTRaw (Procurement) component, raw material procurement time is included only when sufficient raw material is not available to meet customer order fulfillment requirements."]
["MCTOperations (Planning)","Includes all product specific planning order fulfillment activities."]
["MCTRaw","Includes raw material inventory and the corresponding supply management raw material procurement activities (for the supplier’s supplier).  Additionally, raw material procurement time is included only when sufficient raw material is not available to meet customer order fulfillment requirements.  The raw material inventory and procurement components are typically identified separately as MCTRaw (Inventory) and MCTRaw (Procurement).  It often helps to think of MCTRaw as purchasing to order instead of purchasing to forecast."]
["MCTOperations (Mfg.)","Includes all product specific manufacturing order fulfillment activities."]
{"$rows_left_out":3}
{"sheet":"History of Changes","index":12,"n_rows":17,"n_cols":5,"rows_kept":17,"cut":false,"hidden":false,"merged":[[1,0,1,4],[0,0,0,4]]}
["JOHN DEERE OF Risk Assessment"]
["CHANGE HISTORY"]
["Date","Division(s)","Owner","Reason for Change","Others contributing to Change"]
["2007-08-10","All","Robert Smola","Original issue of OFP Readiness Assessment","AED - Dan Warren, CCE - Brook Richardson, CFD - Ed Pederson, JDPS - Bruce Swanson"]
["2007-08-20","All","Robert Smola","Add \"Corrective Action\" worksheet and request for feedback in the \"Intent\" worksheet.","AED - Dan Warren, CCE - Brook Richardson, CFD - Ed Pederson, JDPS - Bruce Swanson"]
["2007-11-11","All","Robert Smola","Corrected mis-referenced cells in the Make the Order Section major non-conformances for questions 3.1, 3.2, 3.3, 4.3","CCE - Brook Richardson"]
{"$rows_left_out":11}