{"text_format":"1","workbook":"xlsx","n_sheets":13,"sheets":["Intent","Instructions","OF Readiness Scoring Summary","Action Plan","Addtl Gaps","Leadership","Plan the Order","Acquire the Material","Make the Order","Risk Readiness","Terminology","MCT","History of Changes"],"not_rendered":{"charts":3,"images":3,"macros":1,"external_links":0,"defined_names":19,"comments":1,"pivot_tables":0},"unopened":[],"bounds":{"document_bytes":16777216,"sheet_cells":100000,"rows_first":2000,"rows_last":500,"rows_between":2000,"halvings":0,"cell_chars":16384,"cell_head_chars":4096},"cells_cut":0,"cells_raw":0,"read":"whole","date_system":"1900"}

{"sheet":"Intent","index":0,"n_rows":12,"n_cols":1,"rows_kept":12,"cut":false,"hidden":false,"merged":[[7,0,7,2],[3,0,3,2],[8,0,8,2],[11,0,11,2],[9,0,9,2],[4,0,4,2],[10,0,10,2],[0,0,0,2],[1,0,1,2],[2,0,2,2],[5,0,5,2],[6,0,6,2]]}
["OF Risk Assessment - Intent"]
["This is a high-level assessment intended to assess supplier order fulfillment (Delivery) readiness, identify risks, and drive improvements."]
["This assessment is performed at the supplier and takes approximately 1.5 days to complete."]
["Click here to review EXPECTATIONS OF SUPPLIER"]
["Click here to review ASSESSOR INSTRUCTIONS"]
["John Deere targets a minimum score of 3 for each question to limit order fulfillment risk in the supply chain. Questions scored below a 3 are considered to be gaps-to-the-assessment. As part of the supplier selection process, each gap will require an Action Plan and must be reviewed with John Deere Supply Management professionals."]
{"$rows_left_out":7}
{"sheet":"Instructions","index":1,"n_rows":70,"n_cols":6,"rows_kept":70,"cut":false,"hidden":false,"merged":[[0,0,0,3],[2,1,2,3],[3,1,3,3],[4,1,4,2],[30,1,30,3],[9,1,9,3],[17,1,17,3],[18,1,18,3],[22,1,22,3],[23,1,23,3],[24,1,24,3],[21,1,21,3],[25,1,25,3],[26,1,26,3],[1,0,1,3],[28,1,28,3],[7,0,7,1],[69,1,69,3],[51,1,52,1],[51,2,52,2],[51,3,52,3],[59,1,59,4],[51,4,52,4],[60,1,61,1],[60,2,61,2],[60,3,61,3],[60,4,61,4],[68,1,68,2],[50,1,50,4],[31,1,31,3],[5,0,5,1],[48,1,48,2],[47,1,47,2],[46,1,46,2],[45,1,45,2],[16,0,16,1],[15,0,15,1],[14,0,14,1],[12,0,12,1],[6,0,6,1],[20,0,20,3],[13,0,13,1],[29,1,29,3],[34,1,34,3],[27,1,27,3],[8,0,8,1]]}
["Order Fulfillment Risk Assessment"]
["EXPECTATIONS OF SUPPLIER"]
["o","Watch the 4 min. OFRA introduction video (no login required)"]
["o","Notify lead assessor of any specific requirements of entry to facility such as personal protective equipment, confidentiality agreements, multiple manufacturing locations, etc."]
["o","Prepare for assessment"]
["o",null,"Assign an owner for each section"]
{"$rows_left_out":65}
{"sheet":"OF Readiness Scoring Summary","index":2,"n_rows":54,"n_cols":9,"rows_kept":54,"cut":false,"hidden":false,"merged":[[46,4,46,5],[46,6,46,7],[47,4,47,5],[47,6,47,7],[50,2,50,3],[48,4,48,5],[48,6,48,7],[40,2,40,3],[40,6,40,7],[28,6,28,7],[29,6,29,7],[30,4,30,5],[31,4,31,7],[32,4,32,7],[44,6,44,7],[45,4,45,5],[45,6,45,7],[25,6,25,7],[25,4,25,5],[43,4,43,5],[43,6,43,7],[44,4,44,5],[30,6,30,7],[26,4,26,5],[27,4,27,5],[28,4,28,5],[29,4,29,5],[42,4,42,5],[42,6,42,7],[27,6,27,7],[24,2,24,3],[16,1,16,7],[19,1,19,7],[18,0,18,7],[24,4,24,5],[24,6,24,7],[13,4,13,7],[15,0,15,7],[14,0,14,7],[22,2,22,7],[17,1,17,7],[20,1,20,7],[3,2,3,3],[3,4,3,7],[4,2,4,3],[4,4,4,7],[5,2,5,3],[5,4,5,7],[0,2,0,4],[0,5,0,7],[1,2,1,3],[1,4,1,7],[2,2,2,3],[2,4,2,7],[26,6,26,7],[41,4,41,5],[41,6,41,7],[40,4,40,5],[6,2,6,3],[6,4,6,7],[7,4,7,7],[7,2,7,3],[8,4,8,7],[10,2,10,3],[10,4,10,7],[11,2,11,3],[11,4,11,7],[9,4,9,7],[12,4,12,7],[13,2,13,3]]}
["SUPPLIER NAME: ",null,"ASSESSMENT DATE: "]
[]
["Supplier #: ",null,"Audit #:"]
[null,null,"Other Supplier Participants: "]
["Address:"]
[]
{"$rows_left_out":49}
{"sheet":"Action Plan","index":3,"n_rows":23,"n_cols":8,"rows_kept":23,"cut":false,"hidden":false,"merged":[[4,0,5,7],[20,0,21,7],[22,5,22,7],[23,5,23,7],[24,5,24,7],[26,5,26,7],[6,0,6,4],[6,5,6,7],[22,2,22,4],[23,2,23,4],[24,2,24,4],[25,2,25,4],[26,2,26,4],[25,5,25,7],[31,2,31,4],[30,5,30,7],[31,5,31,7],[32,2,32,4],[33,2,33,4],[32,5,32,7],[33,5,33,7],[30,2,30,4],[27,2,27,4],[27,5,27,7],[28,2,28,4],[29,2,29,4],[28,5,28,7],[29,5,29,7],[1,2,1,3],[2,2,2,3],[0,5,0,7],[1,5,1,7],[2,5,2,7]]}
["Supplier Name: ",null,null,{"$f":"IF(NOT(ISBLANK('OF Readiness Scoring Summary'!B1)),'OF Readiness Scoring Summary'!B1,\"\")","v":""},"Assessment Date:",{"$f":"IF(NOT(ISBLANK('OF Readiness Scoring Summary'!F1)),'OF Readiness Scoring Summary'!F1,\"\")","v":""}]
[null,"Supplier Location: ",null,null,"Updated Date: "]
[null,"Supplier Number: ",{"$f":"IF(NOT(ISBLANK('OF Readiness Scoring Summary'!B3)),'OF Readiness Scoring Summary'!B3,\"\")","v":""},null,"Lead Assessor: ",{"$f":"IF(NOT(ISBLANK('OF Readiness Scoring Summary'!E7)),'OF Readiness Scoring Summary'!E7,\"\")","v":""}]
[]
["GAPS TO THE ASSESSMENT\nSupplier scored less than a 3 for each question below and should provide corrective action to close the gap.\n NCCA(s) or factory equivalent to be created for scores of 0 or 1."]
[]
{"$rows_left_out":18}
{"sheet":"Addtl Gaps","index":4,"n_rows":4,"n_cols":8,"rows_kept":4,"cut":false,"hidden":false,"merged":[[2,0,2,4],[2,5,2,7],[0,0,1,7]]}
["GAPS TO THE ASSESSMENT\nSupplier scored less than a 3 for each question below and should provide corrective action to close the gap.\n NCCA(s) or factory equivalent to be created for scores of 0 or 1."]
[]
["John Deere Assessor",null,null,null,null,"Supplier Completes"]
["Category","Question\nNumber","Score","Gap Description","NCCA\n#","Action Plan","Owner","Target\nDate"]

{"sheet":"Leadership","index":5,"n_rows":15,"n_cols":12,"rows_kept":15,"cut":false,"hidden":false,"merged":[[0,11,1,11],[2,4,3,4],[2,5,2,7],[2,11,3,11],[2,0,3,0],[2,1,3,1],[2,2,3,2],[2,3,3,3],[2,10,3,10],[1,3,1,10],[1,0,1,2]]}
["Order Fulfillment (OF) Risk Assessment",null,null,null,null,null,null,null,null,null,null,"Supplier \"Leadership\" Lane Owner:\n Name: \n Email:\n Phone:"]
["Leadership",null,null,"This section includes all activities that the supplier performs from a strategic position to ensure continuity of supply and continual improvement."]
["#","Question Content","Interview Questions\nSupplier to demonstrate compliance through examples","Score \n(0-5)        0=low","Assessment Comments - Required:  Describe in detail what the supplier used to support their answer","Scoring Criteria",null,null,"Maximum Points","Achieved Points","Required Verification","Example Supporting Evidence\n(see Intent tab for clarification)"]
[null,null,null,null,null,1,3,5,{"$f":"SUM(I5,I8,I11,I14)","v":300},{"$f":"SUM(J5,J8,J11,J14)","v":0}]
["1. Organization Measures",null,null,{"$f":"J5/I5","v":0},null,null,null,null,{"$f":"SUM(I6:I7)","v":125},{"$f":"SUM(J6:J7)","v":0}]
[1.1000000000000001,"Business Process Documentation","What methods are used to document your Order Fulfillment process flow (Plan the Order, Acquire the Material, Make the Order, Deliver the Order)?\n\nHow are these methods used to drive improvement in your organization?",null,null,"● Limited documentation of process flow","● Detailed value stream maps (VSM) or equivalent are available for at least one product line\n\n● Documentation is current and includes Plan, Acquire, Make and Deliver steps\n\n● VSM or equivalent includes most of the information required to calculate MCT response \n\n● Supplier can demonstrate improvement driven from VSM or equivalent","● All of a \"3\"\n\n● Detailed VSM or equivalent are available for most product lines\n\n● VSM's or equivalent include all information required to calculate MCT response \n\n● MCT map can be generated within 72 hours (with Deere training)\n\n● Supplier can demonstrate a history of improvement driven from VSM or equivalent for most product lines ",{"$f":"IF($D6=\"N/A\",0,75)","v":75},{"$f":"IF(D6=\"N/A\",0,IF(D6>5,\"Error\",D6*I6/5))","v":0},"Documentation","Value Stream Maps\nProcess Maps\nFlow charts\nManufacturing Critical-path Time maps\nSpaghetti diagrams\nVSM improvement project documentation"]
{"$rows_left_out":10}
{"sheet":"Plan the Order","index":6,"n_rows":10,"n_cols":12,"rows_kept":10,"cut":false,"hidden":false,"merged":[[2,4,3,4],[2,5,2,7],[0,0,0,10],[2,10,3,10],[2,11,3,11],[1,3,1,10],[1,0,1,2],[0,11,1,11],[2,0,3,0],[2,1,3,1],[2,2,3,2],[2,3,3,3]]}
["Order Fulfillment (OF) Risk Assessment",null,null,null,null,null,null,null,null,null,null,"Supplier \"Plan the Order\" Lane Owner:\n Name: \n Email:\n Phone:"]
["Plan the Order",null,null,"This section pertains to ensuring the supplier has a system in place to receive Deere forecast and firm order requirements and to transfer them to their in house production planning system."]
["#","Question Content","Interview Questions\nSupplier to demonstrate compliance through examples","Score \n(0-5)        0=low","Assessment Comments - Required:  Describe in detail what the supplier used to support their answer","Scoring Criteria",null,null,"Maximum Points","Achieved Points","Required Verification","Example Supporting Evidence\n(see Intent tab for clarification)"]
[null,null,null,null,null,1,3,5,{"$f":"SUM(I6,I8:I10)","v":75},{"$f":"SUM(J5,J7)","v":0}]
["1. Order Receiving",null,null,{"$f":"+J5/I5","v":0},null,null,null,null,{"$f":"SUM(I6)","v":20},{"$f":"SUM(J6)","v":0}]
[1.1000000000000001,"Order Receipt","How do you receive orders from your customers? \n\nHow do you transfer orders into your material requirements planning system (MRP) or production planning system?",null,null,"● Extensive manual processes  to receive and input customer orders","● Web-EDI capable\n\n● Supplier can receive and process customer requirements electronically \n\n● Receipt of orders is not completely integrated with the in-house MRP or ERP system\n\n● Several effective manual interactions are used to input customer orders\n\n● ASN Capable","● All of a \"3\"\n\n● EDI capable\n\n● Customer requirements are automatically integrated into MRP or ERP system \n\n● System is updated at least weekly\n\n● Minimal human interactions to input customer orders\n\n● ASN Accuracy is tracked and documented\n\n● ASN is error-proofed to eliminate mistakes",{"$f":"IF($D6=\"N/A\",0,20)","v":20},{"$f":"IF(D6=\"N/A\",0,D6*I6/5)","v":0},"Physical","Process map\nWork instructions\nDemonstration of order entering process\nASN flow chart or process documentation\nASN accuracy metrics and goals\nDemonstration of ASN Entry\nExamples of ASN improvement actives"]
{"$rows_left_out":5}
{"sheet":"Acquire the Material","index":7,"n_rows":16,"n_cols":12,"rows_kept":16,"cut":false,"hidden":false,"merged":[[2,4,3,4],[2,5,2,7],[0,0,0,10],[2,10,3,10],[2,11,3,11],[0,11,1,11],[1,0,1,2],[1,3,1,10],[2,0,3,0],[2,1,3,1],[2,2,3,2],[2,3,3,3]]}
["Order Fulfillment (OF) Risk Assessment",null,null,null,null,null,null,null,null,null,null,"Supplier \"Acquire the Material\" Lane Owner:\n Name: \n Email:\n Phone:"]
["Acquire the Material",null,null,"This section pertains to ensuring that the supplier has a replenishment system in place with its supply base to ensure that raw material and purchased components are available when needed."]
["#","Question Content","Interview Questions\nSupplier to demonstrate compliance through examples","Score \n(0-5)        0=low","Assessment Comments - Required:  Describe in detail what the supplier used to support their answer","Scoring Criteria",null,null,"Maximum Points","Achieved Points","Required Verification","Example Supporting Evidence\n(see Intent tab for clarification)"]
[null,null,null,null,null,1,3,5,{"$f":"SUM(I5,I9,I12)","v":125},{"$f":"SUM(J5,J9,J12)","v":0}]
["1. Raw Material Inventory",null,null,{"$f":"+J5/I5","v":0},null,null,null,null,{"$f":"SUM(I6:I8)","v":40},{"$f":"SUM(J6:J8)","v":0}]
[1.1000000000000001,"Inventory Accuracy","How do you track the accuracy of your inventory system?",null,null,"● Inventory accuracy is available or can be calculated","● Inventory accuracy is at least 85% and can be verified  \n\n● Historical data provided\n\n● Improvement plan in place when goals are not met","● All of a \"3\"\n\n● Inventory accuracy is 95% or greater and can be verified  \n\n● Performance trends are shared with decision makers (minimum 6 months data)\n\n● Improvement plan is in place as necessary",{"$f":"IF($D6=\"N/A\",0,10)","v":10},{"$f":"IF(D6=\"N/A\",0,D6*I6/5)","v":0},"Documentation","Historical inventory accuracy data\nDocumented inventory accuracy goal\nExample inventory accuracy improvements"]
{"$rows_left_out":11}
{"sheet":"Make the Order","index":8,"n_rows":19,"n_cols":12,"rows_kept":19,"cut":false,"hidden":false,"merged":[[2,4,3,4],[2,5,2,7],[0,0,0,10],[2,10,3,10],[2,11,3,11],[0,11,1,11],[1,0,1,2],[1,3,1,10],[2,0,3,0],[2,1,3,1],[2,2,3,2],[2,3,3,3]]}
["Order Fulfillment (OF) Risk Assessment",null,null,null,null,null,null,null,null,null,null,"Supplier \"Make the Order\" Lane Owner:\n Name: \n Email:\n Phone:"]
["Make the Order",null,null,"This section includes all activities that the supplier performs once the supplier authorizes production and concludes with the completed order staged for pickup."]
["#","Question Content","Interview Questions\nSupplier to demonstrate compliance through examples","Score \n(0-5)        0=low","Assessment Comments - Required:  Describe in detail what the supplier used to support their answer","Scoring Criteria",null,null,"Maximum Points","Achieved Points","Required Verification","Example Supporting Evidence\n(see Intent tab for clarification)"]
[null,null,null,null,null,1,3,5,{"$f":"SUM(I5,I10,I16)","v":200},{"$f":"SUM(J5,J10,J16)","v":0}]
["1. Capability Awareness",null,null,{"$f":"+J5/I5","v":0},null,null,null,null,{"$f":"SUM(I6:I9)","v":95},{"$f":"SUM(J6:J9)","v":0}]
[1.1000000000000001,"Safety Stock Inventory","How do you determine the need for safety stock inventory?\n\nHow are the appropriate quantities determined?\n\nNote: This question addresses work-in-process and/or finished goods. ",null,null,"● Safety stock is determined through experience","● Supplier compares customer firm zone requirement to their lead time  (lead time > customer firm zone = safety stock) \n\n● Safety Stock inventory levels are determined through analysis of order fulfillment system data","● All of a \"3\"\n\n● Collaboration with customers to establish safety stock levels \n\n● Safety stock inventory levels are adjusted as business conditions change",{"$f":"IF($D6=\"N/A\",0,20)","v":20},{"$f":"IF(D6=\"N/A\",0,D6*I6/5)","v":0},"Documentation","Customer Firm Zones\nSafety stock inventory analysis\nFinished goods inventory planning process"]
{"$rows_left_out":14}
{"sheet":"Risk Readiness","index":9,"n_rows":11,"n_cols":12,"rows_kept":11,"cut":false,"hidden":false,"merged":[[2,4,3,4],[2,5,2,7],[0,0,0,10],[2,10,3,10],[2,11,3,11],[0,11,1,11],[1,0,1,2],[1,3,1,10],[2,0,3,0],[2,1,3,1],[2,2,3,2],[2,3,3,3]]}
["Order Fulfillment (OF) Risk Assessment",null,null,null,null,null,null,null,null,null,null,"Supplier \"Risk Readiness\" Lane Owner:\n Name: \n Email:\n Phone:"]
["Risk Readiness ",null,null,"This section includes all activities that the supplier performs once the completed order is staged for pickup until the time the order is received by the customer."]
["#","Question Content","Interview Questions\nSupplier to demonstrate compliance through examples","Score \n(0-5)        0=low","Assessment Comments - Required:  Describe in detail what the supplier used to support their answer","Scoring Criteria",null,null,"Maximum Points","Achieved Points","Required Verification","Example Supporting Evidence\n(see Intent tab for clarification)"]
[null,null,null,null,null,1,3,5,{"$f":"SUM(I5)","v":300},{"$f":"J5","v":0}]
["1. Crisis Management",null,null,{"$f":"J5/I5","v":0},null,null,null,null,{"$f":"SUM(I6:I11)","v":300},{"$f":"SUM(J6:J11)","v":0}]
[1.1000000000000001,"Geographic Risk","How do you manage your environmental, geographical, and political risk? \n(Includes Natural disaster, political unrest, war, utility outages, logistical legislation, etc.)",null,null,"● Aware of potential risks to the business","● Contingency plans are documented and cover most identified risks \n\n● Explanation of plans effectiveness\n\n● Plan includes most catastrophic events but missing personnel contact information\n\n● Plan accounts for loss of building","● All of a \"3\"\n\n● Plan includes all personnel and external contact information\n\n● Back up manufacturing has been identified and PPAP'd\n\n● Supplier regularly reviews and practices plan\n\n● Plan allows proactive and timely communication with customers and suppliers\n\n● Contingency plans are stored on the system and action owners maintain a hard copy for use in crisis",{"$f":"IF($D6=\"N/A\",0,60)","v":60},{"$f":"IF(D6=\"N/A\",0,D6*I6/5)","v":0},null,"Current Contingency (Business Continuity Plans; BCP) plan for each risk\nCurrent Action owners and contacts\nTraining\n"]
{"$rows_left_out":6}
{"sheet":"Terminology","index":10,"n_rows":39,"n_cols":2,"rows_kept":39,"cut":false,"hidden":false,"merged":[]}
["Terminology","Definition"]
["5-S System ","Program focuses on having visual order, organization, cleanliness and standardization. The results you can expect from a Five S program are: improved profitability, efficiency, service and safety."]
["AIAG (The Automotive Industry Action Group) ","A non-profit group to improve the quality of automotive and industrial manufacturers. Website: AIAG.ORG"]
["APQP (Advanced Quality Product Planning)","A program management process to ensure proper development and timing actives for new programs."]
["ASN (Advanced Shipping Notice)","The ASN is issued to the customer prior to product shipment.  It can be used to list the contents of a shipment of goods as well as additional information relating to the shipment, such as order information, product description, physical characteristics, type of packaging, marking, carrier information, and configuration of goods within the transportation equipment."]
["Batch Size","The number of parts produced before changing to the next part number.  Also know as lot size."]
{"$rows_left_out":34}
{"sheet":"MCT","index":11,"n_rows":8,"n_cols":2,"rows_kept":8,"cut":false,"hidden":false,"merged":[[1,3,1,4],[2,3,2,4]]}
["Terminology","Definition"]
["MCTTotal","MCTTotal is a measure of order fulfillment lean-ness and is used to drive reduction in system wide waste.  MCTTotal is composed of all components of MCT, including:  MCTRaw (Procurement and Inventory), MCTOperations (Planning and Manufacturing), MCTLogistics, and MCTContingency"]
["MCTResponse","MCTResponse is a measure of order fulfillment responsiveness and used to define how long it takes for a supplier to react to previously unplanned orders.  MCTResponse is composed of the MCTRaw (Procurement), MCTOperations (Planning),  MCTOperations (Manufacturing), and MCTLogistics components of MCT.  Also remember for the MCTRaw (Procurement) component, raw material procurement time is included only when sufficient raw material is not available to meet customer order fulfillment requirements."]
["MCTOperations (Planning)","Includes all product specific planning order fulfillment activities."]
["MCTRaw","Includes raw material inventory and the corresponding supply management raw material procurement activities (for the supplier’s supplier).  Additionally, raw material procurement time is included only when sufficient raw material is not available to meet customer order fulfillment requirements.  The raw material inventory and procurement components are typically identified separately as MCTRaw (Inventory) and MCTRaw (Procurement).  It often helps to think of MCTRaw as purchasing to order instead of purchasing to forecast."]
["MCTOperations (Mfg.)","Includes all product specific manufacturing order fulfillment activities."]
{"$rows_left_out":3}
{"sheet":"History of Changes","index":12,"n_rows":16,"n_cols":5,"rows_kept":16,"cut":false,"hidden":false,"merged":[[1,0,1,4],[0,0,0,4]]}
["JOHN DEERE OF Risk Assessment"]
["CHANGE HISTORY"]
["Date","Division(s)","Owner","Reason for Change","Others contributing to Change"]
["2007-08-10","All","Robert Smola","Original issue of OFP Readiness Assessment","AED - Dan Warren, CCE - Brook Richardson, CFD - Ed Pederson, JDPS - Bruce Swanson"]
["2007-08-20","All","Robert Smola","Add \"Corrective Action\" worksheet and request for feedback in the \"Intent\" worksheet.","AED - Dan Warren, CCE - Brook Richardson, CFD - Ed Pederson, JDPS - Bruce Swanson"]
["2007-11-11","All","Robert Smola","Corrected mis-referenced cells in the Make the Order Section major non-conformances for questions 3.1, 3.2, 3.3, 4.3","CCE - Brook Richardson"]
{"$rows_left_out":10}